Reaction Details
TargetLuciferin 4-monooxygenase
LigandBDBM50004870
Substrate/Competitorn/a
Meas. Tech.ChEMBL_938513 (CHEMBL2327197)
IC50 0.89±n/a nM
Citation Poutiainen, PKPalvimo, JJHinkkanen, AEValkonen, AVäisänen, TKLaatikainen, RPulkkinen, JT Discovery of 5-benzyl-3-phenyl-4,5-dihydroisoxazoles and 5-benzyl-3-phenyl-1,4,2-dioxazoles as potent firefly luciferase inhibitors. J Med Chem56:1064-73 (2013) 
 
Luciferin 4-monooxygenase
Name:Luciferin 4-monooxygenase
Type:PROTEIN
Mol. Mass.:60747.46
Organism:Photinus pyralis
Description:ChEMBL_938513
Residue:550
BDBM50004870
NameBDBM50004870
Synonyms:CHEMBL2324051
TypeSmall organic molecule
Emp. Form.C17H14N2O
Mol. Mass.262.3059
SMILESN#Cc1ccc(cc1)C1=NO[C@H](Cc2ccccc2)C1