Reaction Details
TargetCarbonic anhydrase 2
LigandBDBM50079068
Substrate/Competitorn/a
Meas. Tech.ChEMBL_956003 (CHEMBL2380060)
Ki 2.0±n/a nM
Citation Vullo, DLuca, VDScozzafava, ACarginale, VRossi, MSupuran, CTCapasso, C The alpha-carbonic anhydrase from the thermophilic bacterium Sulfurihydrogenibium yellowstonense YO3AOP1 is highly susceptible to inhibition by sulfonamides. Bioorg Med Chem21:1534-8 (2013) 
 
Carbonic anhydrase 2
Name:Carbonic anhydrase 2
Type:Enzyme
Mol. Mass.:29250.71
Organism:Homo sapiens (Human)
Description:P00918
Residue:260
BDBM50079068
NameBDBM50079068
Synonyms:3-amino-N-(5-sulfamoyl-[1,3,4]thiadiazol-2-yl)-propionamide | CHEMBL13646
TypeSmall organic molecule
Emp. Form.C5H9N5O3S2
Mol. Mass.251.287
SMILESNCCC(=O)Nc1nnc(s1)S(N)(=O)=O