Reaction Details
TargetCarbonic anhydrase 9
LigandBDBM50004937
Substrate/Competitorn/a
Meas. Tech.ChEMBL_959999 (CHEMBL2384052)
Ki 322±n/a nM
Citation Carta, FAkdemir, AScozzafava, AMasini, ESupuran, CT Xanthates and trithiocarbonates strongly inhibit carbonic anhydrases and show antiglaucoma effects in vivo. J Med Chem56:4691-700 (2013) 
 
Carbonic anhydrase 9
Name:Carbonic anhydrase 9
Type:Enzyme
Mol. Mass.:49669.03
Organism:Homo sapiens (Human)
Description:Catalytic domain of human cloned isozyme was used in the assay
Residue:459
BDBM50004937
NameBDBM50004937
Synonyms:CHEMBL2380740
TypeSmall organic molecule
Emp. Form.C6H11KOS2
Mol. Mass.202.379
SMILES[K+].CC(C)CCOC([S-])=S