Reaction Details
TargetCarbonic anhydrase 2
LigandBDBM50004945
Substrate/Competitorn/a
Meas. Tech.ChEMBL_960000 (CHEMBL2384053)
Ki 22±n/a nM
Citation Carta, FAkdemir, AScozzafava, AMasini, ESupuran, CT Xanthates and trithiocarbonates strongly inhibit carbonic anhydrases and show antiglaucoma effects in vivo. J Med Chem56:4691-700 (2013) 
 
Carbonic anhydrase 2
Name:Carbonic anhydrase 2
Type:Enzyme
Mol. Mass.:29250.71
Organism:Homo sapiens (Human)
Description:P00918
Residue:260
BDBM50004945
NameBDBM50004945
Synonyms:CHEMBL2380752
TypeSmall organic molecule
Emp. Form.C12H17KOS2
Mol. Mass.280.491
SMILES[K+].[S-]C(=S)OCC12CC3CC(CC(C3)C1)C2