Reaction Details
TargetCarbonic anhydrase 2
LigandBDBM50004946
Substrate/Competitorn/a
Meas. Tech.ChEMBL_960000 (CHEMBL2384053)
Ki 13±n/a nM
Citation Carta, FAkdemir, AScozzafava, AMasini, ESupuran, CT Xanthates and trithiocarbonates strongly inhibit carbonic anhydrases and show antiglaucoma effects in vivo. J Med Chem56:4691-700 (2013) 
 
Carbonic anhydrase 2
Name:Carbonic anhydrase 2
Type:Enzyme
Mol. Mass.:29250.71
Organism:Homo sapiens (Human)
Description:P00918
Residue:260
BDBM50004946
NameBDBM50004946
Synonyms:CHEMBL2380751
TypeSmall organic molecule
Emp. Form.C8H8KNOS2
Mol. Mass.237.384
SMILES[K+].[S-]C(=S)OCCc1ccccn1