Reaction Details
TargetCarbonic anhydrase 2
LigandBDBM50004947
Substrate/Competitorn/a
Meas. Tech.ChEMBL_960000 (CHEMBL2384053)
Ki 5.4±n/a nM
Citation Carta, FAkdemir, AScozzafava, AMasini, ESupuran, CT Xanthates and trithiocarbonates strongly inhibit carbonic anhydrases and show antiglaucoma effects in vivo. J Med Chem56:4691-700 (2013) 
 
Carbonic anhydrase 2
Name:Carbonic anhydrase 2
Type:Enzyme
Mol. Mass.:29250.71
Organism:Homo sapiens (Human)
Description:P00918
Residue:260
BDBM50004947
NameBDBM50004947
Synonyms:CHEMBL2380750
TypeSmall organic molecule
Emp. Form.C15H13KOS2
Mol. Mass.312.491
SMILES[K+].[S-]C(=S)OCC(c1ccccc1)c1ccccc1