Reaction Details
TargetCarbonic anhydrase 1
LigandBDBM50004948
Substrate/Competitorn/a
Meas. Tech.ChEMBL_960001 (CHEMBL2384054)
Ki 76±n/a nM
Citation Carta, FAkdemir, AScozzafava, AMasini, ESupuran, CT Xanthates and trithiocarbonates strongly inhibit carbonic anhydrases and show antiglaucoma effects in vivo. J Med Chem56:4691-700 (2013) 
 
Carbonic anhydrase 1
Name:Carbonic anhydrase 1
Type:Enzyme
Mol. Mass.:28873.37
Organism:Homo sapiens (Human)
Description:P00915
Residue:261
BDBM50004948
NameBDBM50004948
Synonyms:CHEMBL2380749
TypeSmall organic molecule
Emp. Form.C8H7KOS2
Mol. Mass.222.369
SMILES[K+].[S-]C(=S)OCc1ccccc1