Reaction Details
TargetCarbonic anhydrase 1
LigandBDBM50004937
Substrate/Competitorn/a
Meas. Tech.ChEMBL_960001 (CHEMBL2384054)
Ki 638±n/a nM
Citation Carta, FAkdemir, AScozzafava, AMasini, ESupuran, CT Xanthates and trithiocarbonates strongly inhibit carbonic anhydrases and show antiglaucoma effects in vivo. J Med Chem56:4691-700 (2013) 
 
Carbonic anhydrase 1
Name:Carbonic anhydrase 1
Type:Enzyme
Mol. Mass.:28873.37
Organism:Homo sapiens (Human)
Description:P00915
Residue:261
BDBM50004937
NameBDBM50004937
Synonyms:CHEMBL2380740
TypeSmall organic molecule
Emp. Form.C6H11KOS2
Mol. Mass.202.379
SMILES[K+].CC(C)CCOC([S-])=S