Reaction Details
TargetCarbonic anhydrase 12
LigandBDBM50004947
Substrate/Competitorn/a
Meas. Tech.ChEMBL_959998 (CHEMBL2384051)
Ki 63±n/a nM
Citation Carta, FAkdemir, AScozzafava, AMasini, ESupuran, CT Xanthates and trithiocarbonates strongly inhibit carbonic anhydrases and show antiglaucoma effects in vivo. J Med Chem56:4691-700 (2013) 
 
Carbonic anhydrase 12
Name:Carbonic anhydrase 12
Type:Enzyme
Mol. Mass.:39456.00
Organism:Homo sapiens (Human)
Description:Catalytic domain of human cloned isozyme was used in the assay
Residue:354
BDBM50004947
NameBDBM50004947
Synonyms:CHEMBL2380750
TypeSmall organic molecule
Emp. Form.C15H13KOS2
Mol. Mass.312.491
SMILES[K+].[S-]C(=S)OCC(c1ccccc1)c1ccccc1