Reaction Details
TargetCarbonic anhydrase 12
LigandBDBM50004931
Substrate/Competitorn/a
Meas. Tech.ChEMBL_959998 (CHEMBL2384051)
Ki 622±n/a nM
Citation Carta, FAkdemir, AScozzafava, AMasini, ESupuran, CT Xanthates and trithiocarbonates strongly inhibit carbonic anhydrases and show antiglaucoma effects in vivo. J Med Chem56:4691-700 (2013) 
 
Carbonic anhydrase 12
Name:Carbonic anhydrase 12
Type:Enzyme
Mol. Mass.:39456.00
Organism:Homo sapiens (Human)
Description:Catalytic domain of human cloned isozyme was used in the assay
Residue:354
BDBM50004931
NameBDBM50004931
Synonyms:CHEMBL2380746
TypeSmall organic molecule
Emp. Form.C7H14KNO2S2
Mol. Mass.247.42
SMILES[K+].CN(C)CCOCCOC([S-])=S