Reaction Details
TargetProthrombin
LigandBDBM50442881
Substrate/Competitorn/a
Meas. Tech.ChEMBL_982134 (CHEMBL2428849)
IC50 25000±n/a nM
Citation Bijak, MZiewiecki, RSaluk, JPonczek, MPawlaczyk, IKrotkiewski, HWachowicz, BNowak, P Thrombin inhibitory activity of some polyphenolic compounds. Med Chem Res23:2324-2337 (2014) 
 
Prothrombin
Name:Prothrombin
Type:Protein
Mol. Mass.:70029.57
Organism:Homo sapiens (Human)
Description:P00734
Residue:622
BDBM50442881
NameBDBM50442881
Synonyms:SILYBIN A
TypeSmall organic molecule
Emp. Form.C25H22O10
Mol. Mass.482.4362
SMILESCOc1cc(ccc1O)[C@H]1Oc2cc(ccc2O[C@@H]1CO)[C@H]1Oc2cc(O)cc(O)c2C(O)C1=O