Reaction Details
TargetVascular endothelial growth factor receptor 2
LigandBDBM50005214
Substrate/Competitorn/a
Meas. Tech.ChEMBL_1287748 (CHEMBL3111580)
IC50 202±n/a nM
Citation Lintnerová, LGarcía-Caballero, MGregán, FMelichercík, MQuesada, ARDobia?, JLác, JSali?ová, MBohác, A A development of chimeric VEGFR2 TK inhibitor based on two ligand conformers from PDB: 1Y6A complex--medicinal chemistry consequences of a TKs analysis. Eur J Med Chem72:146-59 (2014) 
 
Vascular endothelial growth factor receptor 2
Name:Vascular endothelial growth factor receptor 2
Type:Receptor Tyrosine Kinase
Mol. Mass.:151510.97
Organism:Homo sapiens (Human)
Description:P35968
Residue:1356
BDBM50005214
NameBDBM50005214
Synonyms:CHEMBL3109277
TypeSmall organic molecule
Emp. Form.C23H20BrN3O4S
Mol. Mass.514.392
SMILESCCS(=O)(=O)c1ccc(OC)c(Nc2ncc(o2)-c2cc(Br)cc(c2)-c2ccccn2)c1