Reaction Details
TargetTranslocator protein
LigandBDBM50005292
Substrate/Competitorn/a
Meas. Tech.ChEMBL_1295421 (CHEMBL3131058)
Ki 0.79±n/a nM
Citation Médran-Navarrete, VDamont, APeyronneau, MAKuhnast, BBernards, NPottier, GMarguet, FPuech, FBoisgard, RDollé, F Preparation and evaluation of novel pyrazolo[1,5-a]pyrimidine acetamides, closely related to DPA-714, as potent ligands for imaging the TSPO 18kDa with PET. Bioorg Med Chem Lett24:1550-6 (2014) 
 
Translocator protein
Name:Translocator protein
Type:Mitochondrion membrane protein
Mol. Mass.:18945.84
Organism:Rattus norvegicus (rat)
Description:Competitive binding experiments were performed on rat kidney mitochondrial membranes.
Residue:169
BDBM50005292
NameBDBM50005292
Synonyms:CHEMBL3125364
TypeSmall organic molecule
Emp. Form.C26H31FN4O
Mol. Mass.434.5489
SMILESCCN(CC)C(=O)Cc1c(nn2c(C)cc(C)nc12)-c1ccc(cc1)C#CCCCCF