Reaction Details
TargetDNA-directed RNA polymerase subunit beta'
LigandBDBM50000055
Substrate/Competitorn/a
Meas. Tech.ChEMBL_1334097 (CHEMBL3232507)
IC50 2800±n/a nM
Citation Sinha, BKCox, MGChignell, CFCysyk, RL Synthesis and biological properties of N2-substituted spin-labeled analogues of actinomycin D. J Med Chem22:1051-5 (1979) DNA-directed RNA polymerase subunit beta'
Name:DNA-directed RNA polymerase subunit beta'
Type:PROTEIN
Mol. Mass.:155165.00
Organism:Escherichia coli K-12
Description:ChEMBL_106172
Residue:1407
BDBM50000055
NameBDBM50000055
Synonyms:CHEMBL3228736
TypeSmall organic molecule
Emp. Form.C73H107N14O17
Mol. Mass.1452.7143
SMILES[H][C@@]12CCCN1C(=O)[C@H](NC(=O)[C@@H](NC(=O)c1ccc(C)c3oc4c(C)c(=O)c(NCCNC5CC(C)(C)[N+]([O-])C(C)(C)C5)c(C(=O)N[C@H]5[C@@H](C)OC(=O)[C@H](C(C)C)N(C)C(=O)CN(C)C(=O)[C@]6([H])CCCN6C(=O)[C@H](NC5=O)C(C)C)c4nc13)[C@@H](C)OC(=O)[C@H](C(C)C)N(C)C(=O)CN(C)C2=O)C(C)C