Reaction Details
TargetDNA-directed RNA polymerase subunit beta'
LigandBDBM43866
Substrate/Competitorn/a
Meas. Tech.ChEMBL_1334097 (CHEMBL3232507)
IC50 160±n/a nM
Citation Sinha, BKCox, MGChignell, CFCysyk, RL Synthesis and biological properties of N2-substituted spin-labeled analogues of actinomycin D. J Med Chem22:1051-5 (1979) DNA-directed RNA polymerase subunit beta'
Name:DNA-directed RNA polymerase subunit beta'
Type:PROTEIN
Mol. Mass.:155165.00
Organism:Escherichia coli K-12
Description:ChEMBL_106172
Residue:1407
BDBM43866
NameBDBM43866
Synonyms:2-amino-4,6-dimethyl-3-oxo-1-N,9-N-bis[(3R,6S,7R,10S,16S)-7,11,14-trimethyl-2,5,9,12,15-pentaoxo-3,10-di(propan-2-yl)-8-oxa-1,4,11,14-tetrazabicyclo[14.3.0]nonadecan-6-yl]phenoxazine-1,9-dicarboxamide 2-amino-N,N''''-bis[(3R,6S,7R,10S,16S)-3,10-diisopropyl-2,5,9,12,15-pentaketo-7,11,14-trimethyl-8-oxa-1,4,11,14-tetrazabicyclo[14.3.0]nonadecan-6-yl]-3-keto-4,6-dimethyl-phenoxazine-1,9-dicarboxamide 2-amino-N,N'-bis[(3R,6S,7R,10S,16S)-3,10-diisopropyl-2,5,9,12,15-pentaketo-7,11,14-trimethyl-8-oxa-1,4,11,14-tetrazabicyclo[14.3.0]nonadecan-6-yl]-3-keto-4,6-dimethyl-phenoxazine-1,9-dicarboxamide DACTINOMYCIN MLS001424196 cid_457193
TypePeptide
Emp. Form.C62H86N12O16
Mol. Mass.1255.417
SMILESCC(C)[C@H]1NC(=O)[C@@H](NC(=O)c2ccc(C)c3oc4c(C)c(=O)c(N)c(C(=O)N[C@H]5[C@@H](C)OC(=O)[C@H](C(C)C)N(C)C(=O)CN(C)C(=O)[C@@H]6CCCN6C(=O)[C@H](NC5=O)C(C)C)c4nc23)[C@@H](C)OC(=O)[C@H](C(C)C)N(C)C(=O)CN(C)C(=O)[C@@H]2CCCN2C1=O