Reaction Details
TargetIndolethylamine N-methyltransferase
LigandBDBM50000114
Substrate/Competitorn/a
Meas. Tech.ChEMBL_1333667 (CHEMBL3231053)
IC50 8100±n/a nM
Citation Rokach, JHamel, PHunter, NRReader, GRooney, CSAnderson, PSCragoe, EJMandel, LR Cyclic amidine inhibitors of indolamine N-methyltransferase. J Med Chem22:237-47 (1979) Indolethylamine N-methyltransferase
Name:Indolethylamine N-methyltransferase
Type:PROTEIN
Mol. Mass.:28949.17
Organism:Oryctolagus cuniculus
Description:ChEMBL_108264
Residue:263
BDBM50000114
NameBDBM50000114
Synonyms:CHEMBL3228353
TypeSmall organic molecule
Emp. Form.C5H11IN2S
Mol. Mass.258.124
SMILESI.C\N=C1/SCCN1C