Reaction Details
TargetIndolethylamine N-methyltransferase
LigandBDBM50000133
Substrate/Competitorn/a
Meas. Tech.ChEMBL_1333667 (CHEMBL3231053)
IC50 1670±n/a nM
Citation Rokach, JHamel, PHunter, NRReader, GRooney, CSAnderson, PSCragoe, EJMandel, LR Cyclic amidine inhibitors of indolamine N-methyltransferase. J Med Chem22:237-47 (1979) Indolethylamine N-methyltransferase
Name:Indolethylamine N-methyltransferase
Type:PROTEIN
Mol. Mass.:28949.17
Organism:Oryctolagus cuniculus
Description:ChEMBL_108264
Residue:263
BDBM50000133
NameBDBM50000133
Synonyms:CHEMBL3228259
TypeSmall organic molecule
Emp. Form.C11H16N2O4
Mol. Mass.240.2557
SMILESOC(=O)\C=C\C(O)=O.C1CN2CCCN=C2C1