Reaction Details
TargetIndolethylamine N-methyltransferase
LigandBDBM50000169
Substrate/Competitorn/a
Meas. Tech.ChEMBL_1333667 (CHEMBL3231053)
IC50 700±n/a nM
Citation Rokach, JHamel, PHunter, NRReader, GRooney, CSAnderson, PSCragoe, EJMandel, LR Cyclic amidine inhibitors of indolamine N-methyltransferase. J Med Chem22:237-47 (1979) Indolethylamine N-methyltransferase
Name:Indolethylamine N-methyltransferase
Type:PROTEIN
Mol. Mass.:28949.17
Organism:Oryctolagus cuniculus
Description:ChEMBL_108264
Residue:263
BDBM50000169
NameBDBM50000169
Synonyms:CHEMBL3228261
TypeSmall organic molecule
Emp. Form.C12H18N2O4
Mol. Mass.254.2823
SMILESOC(=O)\C=C\C(O)=O.C1CCC2=NCCCN2C1