Reaction Details
TargetIndolethylamine N-methyltransferase
LigandBDBM50000181
Substrate/Competitorn/a
Meas. Tech.ChEMBL_1333667 (CHEMBL3231053)
IC50 9300±n/a nM
Citation Rokach, JHamel, PHunter, NRReader, GRooney, CSAnderson, PSCragoe, EJMandel, LR Cyclic amidine inhibitors of indolamine N-methyltransferase. J Med Chem22:237-47 (1979) Indolethylamine N-methyltransferase
Name:Indolethylamine N-methyltransferase
Type:PROTEIN
Mol. Mass.:28949.17
Organism:Oryctolagus cuniculus
Description:ChEMBL_108264
Residue:263
BDBM50000181
NameBDBM50000181
Synonyms:CHEMBL3228335
TypeSmall organic molecule
Emp. Form.C11H16N2O4
Mol. Mass.240.2557
SMILESOC(=O)\C=C\C(O)=O.CC1CCC2=NCCN12