Reaction Details
TargetIndolethylamine N-methyltransferase
LigandBDBM50000184
Substrate/Competitorn/a
Meas. Tech.ChEMBL_1333667 (CHEMBL3231053)
IC50 1600±n/a nM
Citation Rokach, JHamel, PHunter, NRReader, GRooney, CSAnderson, PSCragoe, EJMandel, LR Cyclic amidine inhibitors of indolamine N-methyltransferase. J Med Chem22:237-47 (1979) Indolethylamine N-methyltransferase
Name:Indolethylamine N-methyltransferase
Type:PROTEIN
Mol. Mass.:28949.17
Organism:Oryctolagus cuniculus
Description:ChEMBL_108264
Residue:263
BDBM50000184
NameBDBM50000184
Synonyms:CHEMBL3228372
TypeSmall organic molecule
Emp. Form.C8H14N2O4
Mol. Mass.202.2078
SMILESOC(=O)C(O)=O.CCN1CCCC1=N