Reaction Details
TargetIndolethylamine N-methyltransferase
LigandBDBM50000193
Substrate/Competitorn/a
Meas. Tech.ChEMBL_1333667 (CHEMBL3231053)
IC50>10300±n/a nM
Citation Rokach, JHamel, PHunter, NRReader, GRooney, CSAnderson, PSCragoe, EJMandel, LR Cyclic amidine inhibitors of indolamine N-methyltransferase. J Med Chem22:237-47 (1979) Indolethylamine N-methyltransferase
Name:Indolethylamine N-methyltransferase
Type:PROTEIN
Mol. Mass.:28949.17
Organism:Oryctolagus cuniculus
Description:ChEMBL_108264
Residue:263
BDBM50000193
NameBDBM50000193
Synonyms:CHEMBL3228379
TypeSmall organic molecule
Emp. Form.C10H16N2O4
Mol. Mass.228.245
SMILESOC(=O)C(O)=O.CN1CCC\C1=N/C1CC1