Reaction Details
TargetIndolethylamine N-methyltransferase
LigandBDBM50000219
Substrate/Competitorn/a
Meas. Tech.ChEMBL_1333667 (CHEMBL3231053)
IC50 2000±n/a nM
Citation Rokach, JHamel, PHunter, NRReader, GRooney, CSAnderson, PSCragoe, EJMandel, LR Cyclic amidine inhibitors of indolamine N-methyltransferase. J Med Chem22:237-47 (1979) Indolethylamine N-methyltransferase
Name:Indolethylamine N-methyltransferase
Type:PROTEIN
Mol. Mass.:28949.17
Organism:Oryctolagus cuniculus
Description:ChEMBL_108264
Residue:263
BDBM50000219
NameBDBM50000219
Synonyms:CHEMBL3228381
TypeSmall organic molecule
Emp. Form.C5H11BrN2S
Mol. Mass.211.123
SMILESBr.CN1CCCSC1=N