Reaction Details
TargetIndolethylamine N-methyltransferase
LigandBDBM50000301
Substrate/Competitorn/a
Meas. Tech.ChEMBL_1333667 (CHEMBL3231053)
IC50 9800±n/a nM
Citation Rokach, JHamel, PHunter, NRReader, GRooney, CSAnderson, PSCragoe, EJMandel, LR Cyclic amidine inhibitors of indolamine N-methyltransferase. J Med Chem22:237-47 (1979) Indolethylamine N-methyltransferase
Name:Indolethylamine N-methyltransferase
Type:PROTEIN
Mol. Mass.:28949.17
Organism:Oryctolagus cuniculus
Description:ChEMBL_108264
Residue:263
BDBM50000301
NameBDBM50000301
Synonyms:CHEMBL3228384
TypeSmall organic molecule
Emp. Form.C10H14N2O4S
Mol. Mass.258.294
SMILESOC(=O)\C=C\C(O)=O.C\N=C1/CSC=CN1C