Reaction Details
TargetIndolethylamine N-methyltransferase
LigandBDBM80520
Substrate/Competitorn/a
Meas. Tech.ChEMBL_1333667 (CHEMBL3231053)
IC50 2800±n/a nM
Citation Rokach, JHamel, PHunter, NRReader, GRooney, CSAnderson, PSCragoe, EJMandel, LR Cyclic amidine inhibitors of indolamine N-methyltransferase. J Med Chem22:237-47 (1979) Indolethylamine N-methyltransferase
Name:Indolethylamine N-methyltransferase
Type:PROTEIN
Mol. Mass.:28949.17
Organism:Oryctolagus cuniculus
Description:ChEMBL_108264
Residue:263
BDBM80520
NameBDBM80520
Synonyms:(1,4-dimethyl-2-pyridylidene)amine 1,4-dimethylpyridin-2-imine MLS000766151 cid_288604
TypeSmall organic molecule
Emp. Form.C7H10N2
Mol. Mass.122.1677
SMILESCc1ccn(C)c(=N)c1