Reaction Details
TargetMu-type opioid receptor
LigandBDBM50001590
Substrate/Competitorn/a
Meas. Tech.ChEMBL_1336492 (CHEMBL3242769)
EC50 3.4±n/a nM
Citation Mosberg, HIYeomans, LAnand, JPPorter, VSobczyk-Kojiro, KTraynor, JRJutkiewicz, EM Development of a bioavailableµ opioid receptor (MOPr) agonist,d opioid receptor (DOPr) antagonist peptide that evokes antinociception without development of acute tolerance. J Med Chem57:3148-53 (2014) 
 
Mu-type opioid receptor
Name:Mu-type opioid receptor
Type:G Protein-Coupled Receptor (GPCR)
Mol. Mass.:44503.11
Organism:Rattus norvegicus (rat)
Description:Competition binding assays were carried out using membrane preparations from transfected HN9.10 cells that constitutively expressed the mu opioid receptor.
Residue:398
BDBM50001590
NameBDBM50001590
Synonyms:CHEMBL3237722
TypeSmall organic molecule
Emp. Form.C34H46N6O7S2
Mol. Mass.714.895
SMILESCc1cc(O)cc(C)c1C[C@H](N)C(=O)N[C@@H]1CSCCSC(C)(C)[C@@H](NC(=O)C2(Cc3ccccc3C2)NC1=O)C(=O)N[C@@H](CO)C(N)=O