Reaction Details
TargetAdenosine receptor A1
LigandBDBM50003648
Substrate/Competitorn/a
Meas. Tech.ChEMBL_1336093 (CHEMBL3240804)
EC50 12±n/a nM
Citation Louvel, JGuo, DAgliardi, MMocking, TAKars, RPham, TPXia, Lde Vries, HBrussee, JHeitman, LHIjzerman, AP Agonists for the adenosine A1 receptor with tunable residence time. A Case for nonribose 4-amino-6-aryl-5-cyano-2-thiopyrimidines. J Med Chem57:3213-22 (2014) 
 
Adenosine receptor A1
Name:Adenosine receptor A1
Type:G Protein-Coupled Receptor (GPCR)
Mol. Mass.:36520.92
Organism:Homo sapiens (Human)
Description:P30542
Residue:326
BDBM50003648
NameBDBM50003648
Synonyms:CHEMBL3234936
TypeSmall organic molecule
Emp. Form.C23H18ClN5O2S2
Mol. Mass.496.004
SMILESNc1nc(SCc2csc(n2)-c2ccc(Cl)cc2)nc(-c2ccc(OCCO)cc2)c1C#N