Reaction Details
TargetKappa-type opioid receptor
LigandBDBM50004175
Substrate/Competitorn/a
Meas. Tech.ChEMBL_1339024 (CHEMBL3243890)
Ki>375±n/a nM
Citation Toledo, MAPedregal, CLafuente, CDiaz, NMartinez-Grau, MAJiménez, ABenito, ATorrado, AMateos, CJoshi, EMKahl, SDRash, KSMudra, DRBarth, VNShaw, DBMcKinzie, DWitkin, JMStatnick, MA Discovery of a novel series of orally active nociceptin/orphanin FQ (NOP) receptor antagonists based on a dihydrospiro(piperidine-4,7'-thieno[2,3-c]pyran) scaffold. J Med Chem57:3418-29 (2014) 
 
Kappa-type opioid receptor
Name:Kappa-type opioid receptor
Type:G Protein-Coupled Receptor (GPCR)
Mol. Mass.:42648.76
Organism:Homo sapiens (Human)
Description:P41145
Residue:380
BDBM50004175
NameBDBM50004175
Synonyms:CHEMBL3236486
TypeSmall organic molecule
Emp. Form.C24H23ClF2N6OS
Mol. Mass.516.994
SMILESCc1nn(cc1CN1CCC2(CC1)OCC(F)(F)c1cc(Cl)sc21)-c1ncccc1-c1ncc[nH]1