Reaction Details
TargetDelta-type opioid receptor
LigandBDBM50004144
Substrate/Competitorn/a
Meas. Tech.ChEMBL_1339025 (CHEMBL3243891)
Ki>375±n/a nM
Citation Toledo, MAPedregal, CLafuente, CDiaz, NMartinez-Grau, MAJiménez, ABenito, ATorrado, AMateos, CJoshi, EMKahl, SDRash, KSMudra, DRBarth, VNShaw, DBMcKinzie, DWitkin, JMStatnick, MA Discovery of a novel series of orally active nociceptin/orphanin FQ (NOP) receptor antagonists based on a dihydrospiro(piperidine-4,7'-thieno[2,3-c]pyran) scaffold. J Med Chem57:3418-29 (2014) 
 
Delta-type opioid receptor
Name:Delta-type opioid receptor
Type:G Protein-Coupled Receptor (GPCR)
Mol. Mass.:40382.98
Organism:Homo sapiens (Human)
Description:Competition binding assays were carried out using membrane preparations from transfected HN9.10 cells that constitutively expressed the delta opioid receptor.
Residue:372
BDBM50004144
NameBDBM50004144
Synonyms:CHEMBL3236480
TypeSmall organic molecule
Emp. Form.C26H26ClF4N3O7S
Mol. Mass.636.012
SMILESOC(C(O)C(O)=O)C(O)=O.Cc1nn(cc1CN1CCC2(CC1)OCC(F)(F)c1cc(Cl)sc21)-c1c(F)cccc1F