Reaction Details
TargetDelta-type opioid receptor
LigandBDBM50004171
Substrate/Competitorn/a
Meas. Tech.ChEMBL_1339025 (CHEMBL3243891)
Ki>375±n/a nM
Citation Toledo, MAPedregal, CLafuente, CDiaz, NMartinez-Grau, MAJiménez, ABenito, ATorrado, AMateos, CJoshi, EMKahl, SDRash, KSMudra, DRBarth, VNShaw, DBMcKinzie, DWitkin, JMStatnick, MA Discovery of a novel series of orally active nociceptin/orphanin FQ (NOP) receptor antagonists based on a dihydrospiro(piperidine-4,7'-thieno[2,3-c]pyran) scaffold. J Med Chem57:3418-29 (2014) 
 
Delta-type opioid receptor
Name:Delta-type opioid receptor
Type:G Protein-Coupled Receptor (GPCR)
Mol. Mass.:40382.98
Organism:Homo sapiens (Human)
Description:Competition binding assays were carried out using membrane preparations from transfected HN9.10 cells that constitutively expressed the delta opioid receptor.
Residue:372
BDBM50004171
NameBDBM50004171
Synonyms:CHEMBL3236483
TypeSmall organic molecule
Emp. Form.C28H34ClF2N5O7S
Mol. Mass.658.114
SMILESOC(C(O)C(O)=O)C(O)=O.CN(C)Cc1cccnc1-n1cc(CN2CCC3(CC2)OCC(F)(F)c2cc(Cl)sc32)c(C)n1