Reaction Details
TargetRho-associated protein kinase 1
LigandBDBM50004418
Substrate/Competitorn/a
Meas. Tech.ChEMBL_1336572 (CHEMBL3240143)
IC50 288±n/a nM
Citation Chen, HHNamil, ASeverns, BWard, JKelly, CDrace, CMcLaughlin, MAYacoub, SLi, BPatil, RSharif, NHellberg, MRRusinko, APang, IHCombrink, KD In vivo optimization of 2,3-diaminopyrazine Rho Kinase inhibitors for the treatment of glaucoma. Bioorg Med Chem Lett24:1875-9 (2014) 
 
Rho-associated protein kinase 1
Name:Rho-associated protein kinase 1
Type:Serine/threonine-protein kinase
Mol. Mass.:158156.77
Organism:Homo sapiens (Human)
Description:Q13464
Residue:1354
BDBM50004418
NameBDBM50004418
Synonyms:CHEMBL3238163
TypeSmall organic molecule
Emp. Form.C22H33N7O
Mol. Mass.411.5437
SMILESCN(C)CC(O)CN1CCN(CC1)c1nc(cnc1N1CCCC1)-c1ccncc1