Reaction Details
TargetRho-associated protein kinase 2
LigandBDBM50319005
Substrate/Competitorn/a
Meas. Tech.ChEMBL_1336571 (CHEMBL3240142)
IC50 58±n/a nM
Citation Chen, HHNamil, ASeverns, BWard, JKelly, CDrace, CMcLaughlin, MAYacoub, SLi, BPatil, RSharif, NHellberg, MRRusinko, APang, IHCombrink, KD In vivo optimization of 2,3-diaminopyrazine Rho Kinase inhibitors for the treatment of glaucoma. Bioorg Med Chem Lett24:1875-9 (2014) 
 
Rho-associated protein kinase 2
Name:Rho-associated protein kinase 2
Type:Protein
Mol. Mass.:160885.43
Organism:Homo sapiens (Human)
Description:O75116
Residue:1388
BDBM50319005
NameBDBM50319005
Synonyms:(R)-4-(1-aminoethyl)-N-(1H-pyrrolo[2,3-b]pyridin-4-yl)benzamide Y-39983
TypeSmall organic molecule
Emp. Form.C16H16N4O
Mol. Mass.280.3244
SMILESC[C@@H](N)c1ccc(cc1)C(=O)Nc1ccnc2[nH]ccc12