Reaction Details
TargetCarbonic anhydrase 1
LigandBDBM50004509
Substrate/Competitorn/a
Meas. Tech.ChEMBL_1337402 (CHEMBL3241547)
Ki>50000±n/a nM
Citation Moeker, JPeat, TSBornaghi, LFVullo, DSupuran, CTPoulsen, SA Cyclic secondary sulfonamides: unusually good inhibitors of cancer-related carbonic anhydrase enzymes. J Med Chem57:3522-31 (2014) 
 
Carbonic anhydrase 1
Name:Carbonic anhydrase 1
Type:Enzyme
Mol. Mass.:28873.37
Organism:Homo sapiens (Human)
Description:P00915
Residue:261
BDBM50004509
NameBDBM50004509
Synonyms:CHEMBL3233389
TypeSmall organic molecule
Emp. Form.C16H12N4O3S
Mol. Mass.340.356
SMILESCc1cccc(c1)-c1cn(nn1)-c1ccc2C(=O)NS(=O)(=O)c2c1