Reaction Details
TargetCarbonic anhydrase 1
LigandBDBM50004513
Substrate/Competitorn/a
Meas. Tech.ChEMBL_1337402 (CHEMBL3241547)
Ki 8745±n/a nM
Citation Moeker, JPeat, TSBornaghi, LFVullo, DSupuran, CTPoulsen, SA Cyclic secondary sulfonamides: unusually good inhibitors of cancer-related carbonic anhydrase enzymes. J Med Chem57:3522-31 (2014) 
 
Carbonic anhydrase 1
Name:Carbonic anhydrase 1
Type:Enzyme
Mol. Mass.:28873.37
Organism:Homo sapiens (Human)
Description:P00915
Residue:261
BDBM50004513
NameBDBM50004513
Synonyms:CHEMBL3233393
TypeSmall organic molecule
Emp. Form.C17H14N4O4S
Mol. Mass.370.382
SMILESCOc1ccc(-c2cn(nn2)-c2ccc3C(=O)NS(=O)(=O)c3c2)c(C)c1