Reaction Details
TargetCarbonic anhydrase 2
LigandBDBM50004510
Substrate/Competitorn/a
Meas. Tech.ChEMBL_1337403 (CHEMBL3241548)
Ki>50000±n/a nM
Citation Moeker, JPeat, TSBornaghi, LFVullo, DSupuran, CTPoulsen, SA Cyclic secondary sulfonamides: unusually good inhibitors of cancer-related carbonic anhydrase enzymes. J Med Chem57:3522-31 (2014) 
 
Carbonic anhydrase 2
Name:Carbonic anhydrase 2
Type:Enzyme
Mol. Mass.:29250.71
Organism:Homo sapiens (Human)
Description:P00918
Residue:260
BDBM50004510
NameBDBM50004510
Synonyms:CHEMBL3233390
TypeSmall organic molecule
Emp. Form.C16H9F3N4O3S
Mol. Mass.394.328
SMILESFC(F)(F)c1ccccc1-c1cn(nn1)-c1ccc2C(=O)NS(=O)(=O)c2c1