Reaction Details
TargetCarbonic anhydrase 2
LigandBDBM50004511
Substrate/Competitorn/a
Meas. Tech.ChEMBL_1337403 (CHEMBL3241548)
Ki>50000±n/a nM
Citation Moeker, JPeat, TSBornaghi, LFVullo, DSupuran, CTPoulsen, SA Cyclic secondary sulfonamides: unusually good inhibitors of cancer-related carbonic anhydrase enzymes. J Med Chem57:3522-31 (2014) 
 
Carbonic anhydrase 2
Name:Carbonic anhydrase 2
Type:Enzyme
Mol. Mass.:29250.71
Organism:Homo sapiens (Human)
Description:P00918
Residue:260
BDBM50004511
NameBDBM50004511
Synonyms:CHEMBL3233391
TypeSmall organic molecule
Emp. Form.C16H12N4O4S
Mol. Mass.356.356
SMILESCOc1ccc(cc1)-c1cn(nn1)-c1ccc2C(=O)NS(=O)(=O)c2c1