Reaction Details
TargetCarbonic anhydrase 12
LigandBDBM50004514
Substrate/Competitorn/a
Meas. Tech.ChEMBL_1337410 (CHEMBL3241555)
Ki 9.5±n/a nM
Citation Moeker, JPeat, TSBornaghi, LFVullo, DSupuran, CTPoulsen, SA Cyclic secondary sulfonamides: unusually good inhibitors of cancer-related carbonic anhydrase enzymes. J Med Chem57:3522-31 (2014) 
 
Carbonic anhydrase 12
Name:Carbonic anhydrase 12
Type:Enzyme
Mol. Mass.:39456.00
Organism:Homo sapiens (Human)
Description:Catalytic domain of human cloned isozyme was used in the assay
Residue:354
BDBM50004514
NameBDBM50004514
Synonyms:CHEMBL3233394
TypeSmall organic molecule
Emp. Form.C15H11N5O5S2
Mol. Mass.405.408
SMILESNS(=O)(=O)c1cccc(c1)-c1cn(nn1)-c1ccc2C(=O)NS(=O)(=O)c2c1