Reaction Details
TargetEstrogen receptor beta
LigandBDBM50005595
Substrate/Competitorn/a
Meas. Tech.ChEMBL_1339080 (CHEMBL3243177)
IC50 7.0±n/a nM
Citation Liao, ZQDong, CCarlson, KESrinivasan, SNwachukwu, JCChesnut, RWSharma, ANettles, KWKatzenellenbogen, JAZhou, HB Triaryl-substituted Schiff bases are high-affinity subtype-selective ligands for the estrogen receptor. J Med Chem57:3532-45 (2014) 
 
Estrogen receptor beta
Name:Estrogen receptor beta
Type:Protein
Mol. Mass.:59238.43
Organism:Homo sapiens (Human)
Description:Q92731
Residue:530
BDBM50005595
NameBDBM50005595
Synonyms:CHEMBL3234621
TypeSmall organic molecule
Emp. Form.C19H14FNO2
Mol. Mass.307.3184
SMILES[#8]-c1ccc(cc1)-[#6](=[#7]/c1ccc(F)cc1)\c1ccc(-[#8])cc1