Reaction Details
TargetHistone deacetylase 4
LigandBDBM19149
Substrate/Competitorn/a
Meas. Tech.ChEMBL_1335254 (CHEMBL3238607)
IC50 490±n/a nM
Citation Cincinelli, RMusso, LGiannini, GZuco, VDe Cesare, MZunino, FDallavalle, S Influence of the adamantyl moiety on the activity of biphenylacrylohydroxamic acid-based HDAC inhibitors. Eur J Med Chem79:251-9 (2014) 
 
Histone deacetylase 4
Name:Histone deacetylase 4
Type:Enzyme
Mol. Mass.:119049.39
Organism:Homo sapiens (Human)
Description:P56524
Residue:1084
BDBM19149
NameBDBM19149
Synonyms:CHEMBL98 SAHA US10188756, Compound SAHA US11505523, Compound SAHA US9353061, SAHA US9695181, Vorinostat Zolinza suberoylanilide hydroxamic acid
TypeSmall organic molecule
Emp. Form.C14H20N2O3
Mol. Mass.264.3202
SMILESONC(=O)CCCCCCC(=O)Nc1ccccc1