Reaction Details
TargetHistone deacetylase 9
LigandBDBM50293369
Substrate/Competitorn/a
Meas. Tech.ChEMBL_1335259 (CHEMBL3238612)
IC50>100000±n/a nM
Citation Cincinelli, RMusso, LGiannini, GZuco, VDe Cesare, MZunino, FDallavalle, S Influence of the adamantyl moiety on the activity of biphenylacrylohydroxamic acid-based HDAC inhibitors. Eur J Med Chem79:251-9 (2014) 
 
Histone deacetylase 9
Name:Histone deacetylase 9
Type:Enzyme
Mol. Mass.:111304.31
Organism:Homo sapiens (Human)
Description:Q9UKV0
Residue:1011
BDBM50293369
NameBDBM50293369
Synonyms:CHEMBL538364 | E,E-5-(4'-Methoxybiphenyl-4-yl)-penta-2,4-dienoic acid Nhydroxyamide
TypeSmall organic molecule
Emp. Form.C18H17NO3
Mol. Mass.295.3325
SMILESCOc1ccc(cc1)-c1ccc(\C=C\C=C\C(=O)NO)cc1