Reaction Details
TargetHistone deacetylase 9
LigandBDBM50005732
Substrate/Competitorn/a
Meas. Tech.ChEMBL_1335259 (CHEMBL3238612)
IC50>100000±n/a nM
Citation Cincinelli, RMusso, LGiannini, GZuco, VDe Cesare, MZunino, FDallavalle, S Influence of the adamantyl moiety on the activity of biphenylacrylohydroxamic acid-based HDAC inhibitors. Eur J Med Chem79:251-9 (2014) 
 
Histone deacetylase 9
Name:Histone deacetylase 9
Type:Enzyme
Mol. Mass.:111304.31
Organism:Homo sapiens (Human)
Description:Q9UKV0
Residue:1011
BDBM50005732
NameBDBM50005732
Synonyms:CHEMBL3235787
TypeSmall organic molecule
Emp. Form.C28H31NO3
Mol. Mass.429.5506
SMILESCOc1ccc(cc1C12CC3CC(CC(C3)C1)C2)-c1ccc(\C=C\C=C\C(=O)NO)cc1