Reaction Details
TargetProlyl endopeptidase
LigandBDBM50155838
Substrate/Competitorn/a
Meas. Tech.ChEMBL_1336166 (CHEMBL3241126)
Ki 0.100000±n/a nM
Citation Kallinen, ATodorov, BKallionpää, RBäck, SSarparanta, MRaki, MGarcía-Horsman, JABergström, KAWallén, EAMännistö, PTAiraksinen, AJ Synthesis and biological evaluation of novel (123)I-labeled 4-(4-iodophenyl)butanoyl-L-prolyl-(2S)-pyrrolidines for imaging prolyl oligopeptidase in vivo. Eur J Med Chem79:436-45 (2014) 
 
Prolyl endopeptidase
Name:Prolyl endopeptidase
Type:n/a
Mol. Mass.:80758.04
Organism:Sus scrofa
Description:n/a
Residue:710
BDBM50155838
NameBDBM50155838
Synonyms:(S)-1-((S)-1-(4-phenylbutanoyl)pyrrolidine-2-carbonyl)pyrrolidine-2-carbonitrile CHEMBL189620
TypeSmall organic molecule
Emp. Form.C20H25N3O2
Mol. Mass.339.4314
SMILESO=C(CCCc1ccccc1)N1CCC[C@H]1C(=O)N1CCC[C@H]1C#N