Reaction Details
TargetProlyl endopeptidase
LigandBDBM50005880
Substrate/Competitorn/a
Meas. Tech.ChEMBL_1336166 (CHEMBL3241126)
Ki 4.2±n/a nM
Citation Kallinen, ATodorov, BKallionpää, RBäck, SSarparanta, MRaki, MGarcía-Horsman, JABergström, KAWallén, EAMännistö, PTAiraksinen, AJ Synthesis and biological evaluation of novel (123)I-labeled 4-(4-iodophenyl)butanoyl-L-prolyl-(2S)-pyrrolidines for imaging prolyl oligopeptidase in vivo. Eur J Med Chem79:436-45 (2014) 
 
Prolyl endopeptidase
Name:Prolyl endopeptidase
Type:n/a
Mol. Mass.:80758.04
Organism:Sus scrofa
Description:n/a
Residue:710
BDBM50005880
NameBDBM50005880
Synonyms:CHEMBL3236273
TypeSmall organic molecule
Emp. Form.C20H24IN3O2
Mol. Mass.465.3279
SMILESIc1ccc(CCCC(=O)N2CCC[C@H]2C(=O)N2CCC[C@H]2C#N)cc1