Reaction Details
TargetSigma non-opioid intracellular receptor 1
LigandBDBM50006606
Substrate/Competitorn/a
Meas. Tech.ChEMBL_1334705 (CHEMBL3238652)
Ki 10.0±n/a nM
Citation Mach, RHZeng, CHawkins, WG Thes2 receptor: a novel protein for the imaging and treatment of cancer. J Med Chem56:7137-60 (2013) 
 
Sigma non-opioid intracellular receptor 1
Name:Sigma non-opioid intracellular receptor 1
Type:Enzyme Catalytic Domain
Mol. Mass.:25124.85
Organism:Homo sapiens (Human)
Description:Q99720
Residue:223
BDBM50006606
NameBDBM50006606
Synonyms:CHEMBL3235106
TypeSmall organic molecule
Emp. Form.C30H32N2O3S
Mol. Mass.500.652
SMILESO=S(=O)(c1ccccc1)n1cc(CCCCN2CCC3(CC2)OCc2ccccc32)c2ccccc12