Reaction Details
TargetD(3) dopamine receptor
LigandBDBM50137626
Substrate/Competitorn/a
Meas. Tech.ChEMBL_1334696 (CHEMBL3238579)
Ki 2.1±n/a nM
Citation Mach, RHZeng, CHawkins, WG Thes2 receptor: a novel protein for the imaging and treatment of cancer. J Med Chem56:7137-60 (2013) 
 
D(3) dopamine receptor
Name:D(3) dopamine receptor
Type:n/a
Mol. Mass.:44243.43
Organism:Homo sapiens (Human)
Description:n/a
Residue:400
BDBM50137626
NameBDBM50137626
Synonyms:5-Bromo-N-{4-[4-(2,3-dichloro-phenyl)-piperazin-1-yl]-butyl}-2,3-dimethoxy-benzamide | CHEMBL59713
TypeSmall organic molecule
Emp. Form.C23H28BrCl2N3O3
Mol. Mass.545.297
SMILESCOc1cc(Br)cc(C(=O)NCCCCN2CCN(CC2)c2cccc(Cl)c2Cl)c1OC