Reaction Details
TargetSigma non-opioid intracellular receptor 1
LigandBDBM50137615
Substrate/Competitorn/a
Meas. Tech.ChEMBL_1334705 (CHEMBL3238652)
Ki 2932±n/a nM
Citation Mach, RHZeng, CHawkins, WG Thes2 receptor: a novel protein for the imaging and treatment of cancer. J Med Chem56:7137-60 (2013) 
 
Sigma non-opioid intracellular receptor 1
Name:Sigma non-opioid intracellular receptor 1
Type:Enzyme Catalytic Domain
Mol. Mass.:25124.85
Organism:Homo sapiens (Human)
Description:Q99720
Residue:223
BDBM50137615
NameBDBM50137615
Synonyms:5-Bromo-N-[2-(6,7-dimethoxy-3,4-dihydro-1H-isoquinolin-2-yl)-ethyl]-2,3-dimethoxy-benzamide | CHEMBL64176
TypeSmall organic molecule
Emp. Form.C22H27BrN2O5
Mol. Mass.479.364
SMILESCOc1cc2CCN(CCNC(=O)c3cc(Br)cc(OC)c3OC)Cc2cc1OC