Reaction Details
TargetNeuronal acetylcholine receptor subunit alpha-7
LigandBDBM50006616
Substrate/Competitorn/a
Meas. Tech.ChEMBL_1335296 (CHEMBL3238720)
Ki 18±n/a nM
Citation Gao, YKellar, KJYasuda, RPTran, TXiao, YDannals, RFHorti, AG Derivatives of dibenzothiophene for positron emission tomography imaging ofa7-nicotinic acetylcholine receptors. J Med Chem56:7574-89 (2013) 
 
Neuronal acetylcholine receptor subunit alpha-7
Name:Neuronal acetylcholine receptor subunit alpha-7
Type:Enzyme
Mol. Mass.:56502.44
Organism:Rattus norvegicus (Rat)
Description:Q05941
Residue:502
BDBM50006616
NameBDBM50006616
Synonyms:CHEMBL3235484
TypeSmall organic molecule
Emp. Form.C19H19FN2O2S
Mol. Mass.358.43
SMILESFc1ccc(N2CCN3CCC2CC3)c2-c3ccccc3S(=O)(=O)c12