Reaction Details
TargetNeuronal acetylcholine receptor subunit alpha-3/beta-4
LigandBDBM50006634
Substrate/Competitorn/a
Meas. Tech.ChEMBL_1335310 (CHEMBL3238807)
Ki 100000±n/a nM
Citation Crestey, FJensen, AABorch, MAndreasen, JTAndersen, JBalle, TKristensen, JL Design, synthesis, and biological evaluation of Erythrina alkaloid analogues as neuronal nicotinic acetylcholine receptor antagonists. J Med Chem56:9673-82 (2014) 
 
Neuronal acetylcholine receptor subunit alpha-3/beta-4
Name:Neuronal acetylcholine receptor subunit alpha-3/beta-4
Type:Protein
Mol. Mass.:n/a
Description:n/a
Components:This complex has 2 components.
Component 1
Name:Neuronal acetylcholine receptor subunit alpha-3
Synonyms:ACHA3_RAT Chrna3
Type:Enzyme
Mol. Mass.:56995.52
Organism:Rattus norvegicus (Rat)
Description:P04757
Residue:499
Component 2
Name:Neuronal acetylcholine receptor subunit beta-4
Synonyms:ACHB4_RAT Chrnb4 Neuronal acetylcholine receptor non-alpha-2 chain | Neuronal acetylcholine receptor protein beta-4 subunit
Type:Enzyme
Mol. Mass.:55863.89
Organism:Rattus norvegicus (Rat)
Description:P12392
Residue:495
BDBM50006634
NameBDBM50006634
Synonyms:CHEMBL3235510
TypeSmall organic molecule
Emp. Form.C13H15NO2
Mol. Mass.217.2637
SMILESC1CC2N(C1)CCc1cc3OCOc3cc21