Reaction Details
TargetNeuronal acetylcholine receptor subunit beta-2
LigandBDBM50006638
Substrate/Competitorn/a
Meas. Tech.ChEMBL_1335312 (CHEMBL3238809)
IC50 2600±n/a nM
Citation Crestey, FJensen, AABorch, MAndreasen, JTAndersen, JBalle, TKristensen, JL Design, synthesis, and biological evaluation of Erythrina alkaloid analogues as neuronal nicotinic acetylcholine receptor antagonists. J Med Chem56:9673-82 (2014) 
 
Neuronal acetylcholine receptor subunit beta-2
Name:Neuronal acetylcholine receptor subunit beta-2
Type:PROTEIN
Mol. Mass.:57114.19
Organism:Mus musculus
Description:ChEMBL_108396
Residue:501
BDBM50006638
NameBDBM50006638
Synonyms:CHEMBL2140445
TypeSmall organic molecule
Emp. Form.C11H13NO2
Mol. Mass.191.2264
SMILESCN1CCc2cc3OCOc3cc2C1