Reaction Details
TargetNeuronal acetylcholine receptor subunit beta-2
LigandBDBM50006643
Substrate/Competitorn/a
Meas. Tech.ChEMBL_1335312 (CHEMBL3238809)
IC50>300000±n/a nM
Citation Crestey, FJensen, AABorch, MAndreasen, JTAndersen, JBalle, TKristensen, JL Design, synthesis, and biological evaluation of Erythrina alkaloid analogues as neuronal nicotinic acetylcholine receptor antagonists. J Med Chem56:9673-82 (2014) 
 
Neuronal acetylcholine receptor subunit beta-2
Name:Neuronal acetylcholine receptor subunit beta-2
Type:PROTEIN
Mol. Mass.:57114.19
Organism:Mus musculus
Description:ChEMBL_108396
Residue:501
BDBM50006643
NameBDBM50006643
Synonyms:CHEMBL3235516
TypeSmall organic molecule
Emp. Form.C18H27NO2
Mol. Mass.289.4125
SMILESCOc1cc2CCN(C)C(C3CCCCC3)c2cc1OC