Reaction Details
TargetNeuronal acetylcholine receptor subunit alpha-3/beta-4
LigandBDBM50014648
Substrate/Competitorn/a
Meas. Tech.ChEMBL_1335313 (CHEMBL3238810)
IC50 100000±n/a nM
Citation Crestey, FJensen, AABorch, MAndreasen, JTAndersen, JBalle, TKristensen, JL Design, synthesis, and biological evaluation of Erythrina alkaloid analogues as neuronal nicotinic acetylcholine receptor antagonists. J Med Chem56:9673-82 (2014) 
 
Neuronal acetylcholine receptor subunit alpha-3/beta-4
Name:Neuronal acetylcholine receptor subunit alpha-3/beta-4
Type:Protein
Mol. Mass.:n/a
Description:n/a
Components:This complex has 2 components.
Component 1
Name:Neuronal acetylcholine receptor subunit alpha-3
Synonyms:ACHA3_RAT Chrna3
Type:Enzyme
Mol. Mass.:56995.52
Organism:Rattus norvegicus (Rat)
Description:P04757
Residue:499
Component 2
Name:Neuronal acetylcholine receptor subunit beta-4
Synonyms:ACHB4_RAT Chrnb4 Neuronal acetylcholine receptor non-alpha-2 chain | Neuronal acetylcholine receptor protein beta-4 subunit
Type:Enzyme
Mol. Mass.:55863.89
Organism:Rattus norvegicus (Rat)
Description:P12392
Residue:495
BDBM50014648
NameBDBM50014648
Synonyms:6,7-Dimethoxy-2-methyl-1,2,3,4-tetrahydro-isoquinoline; hydrobromide (o-methylcorypalline) | CHEMBL555787
TypeSmall organic molecule
Emp. Form.C12H17NO2
Mol. Mass.207.2689
SMILESCOc1cc2CCN(C)Cc2cc1OC